Home > Ldap Error > Ldap Error Code 65 Object Class Violation Group

Ldap Error Code 65 Object Class Violation Group

Contents

Join us to help others who have the same bug. But still it is showing same Exception. Here are the answers: 1) Identity Manager version 3.6.1 Patch C Build Revision 28588 2) It is not a custom class actually... It may be of use: Code: Caused by: javax.naming.directory.SchemaViolationException: [LDAP: error code 65 - Object Class Violation]; remaining name 'uid=nperson, ou=webcheck' at com.sun.jndi.ldap.LdapCtx.mapErrorCode(LdapCtx.java:3036) at com.sun.jndi.ldap.LdapCtx.processReturnCode(LdapCtx.java:2951) at com.sun.jndi.ldap.LdapCtx.processReturnCode(LdapCtx.java:2758) at com.sun.jndi.ldap.LdapCtx.c_bind(LdapCtx.java:383) at com.sun.jndi.toolkit.ctx.ComponentDirContext.p_bind(ComponentDirContext.java:277) http://softacoustik.com/ldap-error/ldap-error-code-65-object-class-violation.php

Automated exception search integrated into your IDE Test Samebug Integration for IntelliJ IDEA 0 mark LDAP AddOnly - Error 65 - Object Class Violation Google Groups | 8 years ago | [email protected]' naming exception occurred during processing. News itemsDrupal news Planet Drupal Association news Social media directory Security announcements Jobs Our communityCommunity Getting involved Services, Training & Hosting Groups & Meetups DrupalCon Code of conduct DocumentationDocumentation Drupal 8 Announcement Announcement Module Collapse No announcement yet.

Schemaviolationexception Ldap Error Code 65

LDAP Error: No such object, ldap_read() parameters: One is the Debug message above, and one is very similar: Type: ldap_server Location: http://d7test.site.org/user/70/edit?destination=admin/people Message: LDAP Server ldap_add(uid=cbarkley,ou=members,dc=site,dc=org) Error Server ID = aulv02admin.site.org, asked 1 year ago viewed 2347 times active 1 year ago Related 1Updating OpenLDAP using a Java class419What are the differences between LDAP and Active Directory?4A Java client for LDAP0Java code Converting Game of Life images to lists Is it possible to keep publishing under my professional (maiden) name, different from my married legal name? Please Advice!!

This is what I have so far. Log in or register to post comments Comment #2 taquil CreditAttribution: taquil commented February 19, 2013 at 2:54pm Thanks for the prompt response. Not the answer you're looking for? Ldap Error Code 32 What is the probability that they were born on different days?

Post Reply Bookmark Topic Watch Topic New Topic programming forums Java Java JSRs Mobile Certification Databases Caching Books Engineering Languages Frameworks Products This Site Careers Other all forums Forum: EJB and Just not the UserApp thats why I guess you are talking about the DAL. Try to map attributes that are not listed among the optional attributes for your classes I hope this helps someone else in the future =) Log in or register to post share|improve this answer answered Sep 1 '12 at 7:49 Terry Gardner 54438 add a comment| Your Answer draft saved draft discarded Sign up or log in Sign up using Google

Pentaho BI Platform Tracking | 1 year ago | Elias Vargas Loyola org.pentaho.di.core.exception.KettleException: Error inserting for entry with DN = [uid=mark1,ou=users,dc=ldap,dc=test,dc=org]! [LDAP: error code 65 - no structural object class provided] Log in or register to post comments Add child issue, clone issue Related issues #2164883: LDAP server test returns no group/role memberships Referenced by #2216391: Add support for escaping leading/trailing spaces Comment Cancel Post ulsa Senior Member Join Date: Jul 2005 Posts: 503 Ulrik Sandberg Jayway (www.jayway.com) Spring LDAP project member #5 May 31st, 2008, 03:53 AM It's a schema violation. Below that is a checkbox labeled "Create corresponding LDAP entry." The note on it says,"To enable this an LDAP server must be selected for provisioning to Drupal in admin/config/people/ldap/user and manual

Javax.naming.directory.schemaviolationexception Ldap

Enabling ASCII tracehttp://www-01.ibm.com/support/docview.wss?uid=swg21268246 Enabling audit logginghttp://www-01.ibm.com/support/docview.wss?uid=swg21405323 Found the following details in the ibmslapd.log: 2015-06-15T14:55:34.389188+0:00 GLPCOM008E The required attribute uniqueMember is missing for entry cn=mynewgroup,dc=ibm,dc=com.2015-06-15T14:55:34.389424+0:00 GLPCOM009E The attribute member is not allowed this contact form We just added some custom > attributes to the User and Inet Person classes. Schemaviolationexception Ldap Error Code 65 Not the answer you're looking for? Ldap Error Code 65 - No Structural Object Class Provided Show Hide Answers Answers & comments Related questions After configuring an LDAP to WebSphere Portal using the ConfigWizard, Portal startup fails and is no longer accessible in a browser. 2 Answers

In this case, they would not, so I'll just leave them empty. More about the author I've chosen the member LDAP. The changes have been saved. Mandatory configuration: --user tokens--, uid=[property.name],OU=Non-Enterprise,OU=People,DC=example,DC=com, [dn] --user tokens--, top, [objectclass:0] --user tokens--, person, [objectclass:1] --user tokens--, inetOrgPerson, [objectclass:2] Optional configuration (depending on your Drupal+LDAP configuration): --user tokens--, user, [objectclass:3] --user tokens--, Object Class Violation (65)

Join us to help others who have the same bug. Am I failing to assign the new user to its ou properly? Comment Cancel Post Team Services Tools © Pivotal Software, Inc. check my blog It looks like it saves changes locally, but I've yet to get it to create an LDAP account.

Want to make things right, don't know with whom The determinant of the matrix How to decipher Powershell syntax for text formatting? On the specified page, I've got: 1) under "Manual Drupal Account Creation and Updates" the "Show option on form" option checked. 2) I have "None" for Basic Provisioning to Drupal Account But in trying to prove the transformation send me the following error: 2015/05/08 16:04:03 - INSERT USR LDAP.0 - ERROR (version 5.0.1-stable, build 1 from 2013-11-15_16-08-58 by buildguy) : Exception :

But 1 step at a time.

Forget to map the object classes for your user b. Log in or register to post comments Comment #3 taquil CreditAttribution: taquil commented February 19, 2013 at 3:12pm Ah, I just figured out that the token "[property.name]" was literally that. share|improve this answer edited May 14 '15 at 9:33 answered May 14 '15 at 4:36 EJP 197k17140249 thks for Reply.... Error: > javax.naming.directory.SchemaViolationException: [LDAP: error code 65 - > NDS error: no such class (-604)]; remaining name > 'CN=peteroko,OU=active,OU=users,O=mtn' > javax.naming.directory.SchemaViolationException: [LDAP: error code 65 - > NDS error: no such

Is there a step-by-step guide to using this tool? We get an error "Error: javax.naming.directory.SchemaViolationException: [LDAP: error code 65 - NDS error: no such class (-604)]; " when we try kick off a workflow that modifies a custom attribute "IFSuserID" Follow this question 43 people are following this question. http://softacoustik.com/ldap-error/ldap-error-code-65-object-class-violation-remaining-name.php USB in computer screen not working When does bugfixing become overkill, if ever?

Tired of useless tips? Thanks, Kumar Simpson Kumar Ranch Hand Posts: 261 posted 7 years ago I got the solution.. The Drupal Userid for Cbarkley is 70. Then under "User -> Basic provisoning to LDAP settings" I'm mapping "Provisioning from Drupal to LDAP Mappings", and I have a field where I've selected "--user tokens--" and set the value

I don't want to provision from LDAP to Drupal but the other way around. i have searched high and low for a solution... Join Now I want to fix my crash I want to help others javax.naming.directory.SchemaViolationException: [LDAP: error code 65 - Object Class Violation]; remaining name 'uid=sasidhar,ou=People,o=itba,o=net,o=isp' Stack Overflow | Saba | 1 Comment Cancel Post [emailprotected] Junior Member Join Date: May 2008 Posts: 5 #6 May 31st, 2008, 12:00 PM Thanks, Ulsa.

One thing that may help others in the future is that the error: Object class violation happens not only when you a.